BDBM7451 1-{12-hydroxy-3-phenyl-8-oxa-6-azatricyclo[7.4.0.0^{2,7}]trideca-1(13),2(7),3,5,9,11-hexaen-4-yl}ethan-1-one::3-Acetyl-6-hydroxy-4-phenylbenzo[4,5]furo[2,3-b]pyridine::CHEMBL133712::elbfluorene
SMILES CC(=O)c1cnc2oc3ccc(O)cc3c2c1-c1ccccc1
InChI Key InChIKey=RTDFHOPDAYJLII-UHFFFAOYSA-N
Data  11 IC50
  Tab Delimited (TSV)   2D SDfile   Computed 3D by Vconf -m prep SDfile
Find this compound or compounds like it in BindingDB:
Activity Spreadsheet -- Enzyme Inhibition Constant Data from BindingDB
Found 4 hits for monomerid = 7451
TargetCyclin-dependent kinase 1/G2/mitotic-specific cyclin-B(Marthasterias glacialis (starfish))
Martin-Luther-University Halle-Wittenberg
LigandPNGBDBM7451(1-{12-hydroxy-3-phenyl-8-oxa-6-azatricyclo[7.4.0.0...)
Affinity DataIC50:  4.20E+3nMpH: 7.2 T: 2°C. Assay description: Kinase activities were assayed in buffers containing substrate, enzyme, and inhibitor at 30 °C in the presence of 15 uM ATP/ [gamma-32P] ATP. 32...
In DepthDetails ArticlePubMed
TargetCyclin-dependent kinase 2/G1/S-specific cyclin-E1(Homo sapiens (Human))
Martin-Luther-University Halle-Wittenberg
LigandPNGBDBM7451(1-{12-hydroxy-3-phenyl-8-oxa-6-azatricyclo[7.4.0.0...)
Affinity DataIC50: >1.00E+5nMpH: 7.2 T: 2°C. Assay description: Kinase activities were assayed in buffers containing substrate, enzyme, and inhibitor at 30 °C in the presence of 15 uM ATP/ [gamma-32P] ATP. 32...
In DepthDetails ArticlePubMed
TargetCyclin-dependent kinase 4/G1/S-specific cyclin-D1 [L188C](Homo sapiens (Human))
Martin-Luther-University Halle-Wittenberg
LigandPNGBDBM7451(1-{12-hydroxy-3-phenyl-8-oxa-6-azatricyclo[7.4.0.0...)
Affinity DataIC50: >1.00E+5nMpH: 7.2 T: 2°C. Assay description: Kinase activities were assayed in buffers containing substrate, enzyme, and inhibitor at 30 °C in the presence of 15 uM ATP/ [gamma-32P] ATP. 32...
In DepthDetails ArticlePubMed
LigandPNGBDBM7451(1-{12-hydroxy-3-phenyl-8-oxa-6-azatricyclo[7.4.0.0...)
Affinity DataIC50:  4.20E+3nM. Assay description: Inhibition of Cyclin-dependent kinase 1-cyclin B from M phase starfish (Marthasterias glacialis) oocytes
In DepthDetails ArticlePubMed