BDBM7504 2,6,9-Trisubstituted purine deriv. 4b::6-Chloro-2-iodo-9-isopropyl-9H-purine::6-chloro-2-iodo-9-(propan-2-yl)-9H-purine::CHEMBL337291
SMILES CC(C)n1cnc2c(Cl)nc(I)nc12
InChI Key InChIKey=QDWXVKPYLBNGEU-UHFFFAOYSA-N
Data  4 IC50
  Tab Delimited (TSV)   2D SDfile   Computed 3D by Vconf -m prep SDfile
Find this compound or compounds like it in BindingDB:
Activity Spreadsheet -- Enzyme Inhibition Constant Data from BindingDB
Found 4 hits for monomerid = 7504
TargetCyclin-dependent kinase 1/G2/mitotic-specific cyclin-B(Marthasterias glacialis (starfish))
Institut Curie
LigandPNGBDBM7504(2,6,9-Trisubstituted purine deriv. 4b | 6-Chloro-2...)
Affinity DataIC50:  1.50E+5nMpH: 7.2 T: 2°C. Assay description: Kinase activities were assayed in buffers containing substrate, enzyme, and inhibitor at 30 °C in the presence of 15 uM ATP/ [gamma-32P] ATP. 32...
In DepthDetails ArticlePubMed
TargetCyclin-dependent kinase 5(Homo sapiens (Human))
Institut Curie
Curated by ChEMBL
LigandPNGBDBM7504(2,6,9-Trisubstituted purine deriv. 4b | 6-Chloro-2...)
Affinity DataIC50: >1.00E+5nM. Assay description: Compound was tested for its inhibitory activity against cyclin-dependent kinase 5
In DepthDetails ArticlePubMed
TargetCyclin-dependent kinase 1(Homo sapiens (Human))
Institut Curie
Curated by ChEMBL
LigandPNGBDBM7504(2,6,9-Trisubstituted purine deriv. 4b | 6-Chloro-2...)
Affinity DataIC50:  1.50E+5nM. Assay description: Inhibition of Cyclin-dependent kinase 1 (CDK1)
In DepthDetails ArticlePubMed
TargetCyclin-dependent kinase 5 activator 1(Homo sapiens (Human))
Institut Curie
LigandPNGBDBM7504(2,6,9-Trisubstituted purine deriv. 4b | 6-Chloro-2...)
Affinity DataIC50: >1.00E+5nMpH: 7.2 T: 2°C. Assay description: Kinase activities were assayed in buffers containing substrate, enzyme, and inhibitor at 30 °C in the presence of 15 uM ATP/ [gamma-32P] ATP. 32...
In DepthDetails ArticlePubMed