BDBM7600 2-[(2,5-dichlorophenyl)[6-({4-[3-(dimethylamino)-2-hydroxypropoxy]phenyl}amino)pyrimidin-4-yl]amino]acetonitrile::4,6-bis anilino pyrimidine deriv. 13
SMILES CN(C)CC(O)COc1ccc(Nc2cc(ncn2)N(CC#N)c2cc(Cl)ccc2Cl)cc1
InChI Key InChIKey=UHPKVNVPEONGAY-UHFFFAOYSA-N
Data  2 IC50
  Tab Delimited (TSV)   2D SDfile   Computed 3D by Vconf -m prep SDfile
Find this compound or compounds like it in BindingDB:
Activity Spreadsheet -- Enzyme Inhibition Constant Data from BindingDB
Found 2 hits for monomerid = 7600
TargetCyclin-dependent kinase 2/G1/S-specific cyclin-E1(Homo sapiens (Human))
Astrazeneca
LigandPNGBDBM7600(2-[(2,5-dichlorophenyl)[6-({4-[3-(dimethylamino)-2...)
Affinity DataIC50:  1.00E+3nM. Assay description: The kinase activity was assayed using an in vitro scintillation proximity assay (SPA) for measuring incorporation of [gamma-33P] ATP into GST-Rb.
In DepthDetails ArticlePubMed
TargetCyclin-dependent kinase 4/G1/S-specific cyclin-D1(Homo sapiens (Human))
Astrazeneca
LigandPNGBDBM7600(2-[(2,5-dichlorophenyl)[6-({4-[3-(dimethylamino)-2...)
Affinity DataIC50:  50nMpH: 7.0 T: 2°C. Assay description: The kinase activity was assayed using an in vitro scintillation proximity assay (SPA) for measuring incorporation of [gamma-33P] ATP into GST-Rb.
In DepthDetails ArticlePubMed