BDBM7606 2,4-bis anilino pyrimidine deriv. 2::2-N-{4-[3-(dimethylamino)-2-hydroxypropoxy]phenyl}-4-N-(2-fluorophenyl)pyrimidine-2,4-diamine
SMILES CN(C)CC(O)COc1ccc(Nc2nccc(Nc3ccccc3F)n2)cc1
InChI Key InChIKey=FEEKGGYBLXCKCC-UHFFFAOYSA-N
Data  2 IC50
  Tab Delimited (TSV)   2D SDfile   Computed 3D by Vconf -m prep SDfile
Find this compound or compounds like it in BindingDB:
Activity Spreadsheet -- Enzyme Inhibition Constant Data from BindingDB
Found 2 hits for monomerid = 7606
TargetCyclin-dependent kinase 2/G1/S-specific cyclin-E1(Homo sapiens (Human))
Astrazeneca
LigandPNGBDBM7606(2,4-bis anilino pyrimidine deriv. 2 | 2-N-{4-[3-(d...)
Affinity DataIC50:  7.00E+3nMpH: 7.0 T: 2°C. Assay description: The kinase activity was assayed using an in vitro scintillation proximity assay (SPA) for measuring incorporation of [gamma-33P] ATP into GST-Rb.
In DepthDetails ArticlePubMed
TargetCyclin-dependent kinase 4/G1/S-specific cyclin-D1(Homo sapiens (Human))
Astrazeneca
LigandPNGBDBM7606(2,4-bis anilino pyrimidine deriv. 2 | 2-N-{4-[3-(d...)
Affinity DataIC50:  1.00E+3nMpH: 7.0 T: 2°C. Assay description: The kinase activity was assayed using an in vitro scintillation proximity assay (SPA) for measuring incorporation of [gamma-33P] ATP into GST-Rb.
In DepthDetails ArticlePubMed