BDBM7639 4,6 bis anilino pyrimidine deriv. 12::4-N-{4-[3-(dimethylamino)-2-hydroxypropoxy]phenyl}-6-N-(2-fluoro-5-methylphenyl)pyrimidine-4,6-diamine
SMILES CN(C)CC(O)COc1ccc(Nc2cc(Nc3cc(C)ccc3F)ncn2)cc1
InChI Key InChIKey=RCBOIPKMQXPOTA-UHFFFAOYSA-N
Data  2 IC50
  Tab Delimited (TSV)   2D SDfile   Computed 3D by Vconf -m prep SDfile
Find this compound or compounds like it in BindingDB:
Activity Spreadsheet -- Enzyme Inhibition Constant Data from BindingDB
Found 2 hits for monomerid = 7639
TargetCyclin-dependent kinase 4/G1/S-specific cyclin-D1(Homo sapiens (Human))
Astrazeneca
LigandPNGBDBM7639(4,6 bis anilino pyrimidine deriv. 12 | 4-N-{4-[3-(...)
Affinity DataIC50:  4.00E+3nM. Assay description: The kinase activity was assayed using an in vitro scintillation proximity assay (SPA) for measuring incorporation of [gamma-33P] ATP into GST-Rb.
In DepthDetails ArticlePubMed
TargetCyclin-dependent kinase 2/G1/S-specific cyclin-E1(Homo sapiens (Human))
Astrazeneca
LigandPNGBDBM7639(4,6 bis anilino pyrimidine deriv. 12 | 4-N-{4-[3-(...)
Affinity DataIC50:  8.10E+4nM. Assay description: The kinase activity was assayed using an in vitro scintillation proximity assay (SPA) for measuring incorporation of [gamma-33P] ATP into GST-Rb.
In DepthDetails ArticlePubMed