BDBM80776 2-Acetylamino-5-benzyl-4-methyl-thiophene-3-carboxylic acid methyl ester::2-acetamido-4-methyl-5-(phenylmethyl)-3-thiophenecarboxylic acid methyl ester::2-acetamido-5-benzyl-4-methyl-thiophene-3-carboxylic acid methyl ester::MLS000556098::SMR000175820::cid_746923::methyl 2-acetamido-4-methyl-5-(phenylmethyl)thiophene-3-carboxylate::methyl 2-acetamido-5-benzyl-4-methylthiophene-3-carboxylate
SMILES COC(=O)c1c(C)c(Cc2ccccc2)sc1NC(C)=O
InChI Key InChIKey=QSNASKZXAYHZGL-UHFFFAOYSA-N
Data  2 EC50
  Tab Delimited (TSV)   2D SDfile   Computed 3D by Vconf -m prep SDfile
Find this compound or compounds like it in BindingDB:
Activity Spreadsheet -- Enzyme Inhibition Constant Data from BindingDB
Found 1 hit for monomerid = 80776
TargetHexokinase-1(Homo sapiens (Human))
Burnham Center For Chemical Genomics
Curated by PubChem BioAssay
LigandPNGBDBM80776(2-Acetylamino-5-benzyl-4-methyl-thiophene-3-carbox...)
Affinity DataEC50:  3.94E+4nM. Assay description: Data Source: Sanford-Burnham Center for Chemical Genomics (SBCCG) Source Affiliation: Sanford-Burnham Medical Research Institute (SBMRI, San Diego, C...
In DepthDetails PCBioAssay