BDBM81266 US9695200, 9
SMILES COc1cc(ccn1)-c1c[nH]c2ncc(cc12)-c1cccc(\C=C(/C#N)C(N)=O)c1
InChI Key InChIKey=IHPKLJUJMPDLRV-CAOOACKPSA-N
Data  2 IC50
  Tab Delimited (TSV)   2D SDfile   Computed 3D by Vconf -m prep SDfile
Find this compound or compounds like it in BindingDB:
Activity Spreadsheet -- Enzyme Inhibition Constant Data from BindingDB
Found 2 hits for monomerid = 81266
Target1-phosphatidylinositol 4,5-bisphosphate phosphodiesterase gamma-1(Homo sapiens (Human))
Confluence Life Sciences
US Patent
LigandPNGBDBM81266(US9695200, 9)
Affinity DataIC50: >5.00E+3nMT: 2°C. Assay description: Compounds were serially diluted into DMSO, and then into media to concentrations 10× that of the final assay concentration. Compounds were then added...
In DepthDetails US Patent
TargetTyrosine-protein kinase ITK/TSK(Homo sapiens (Human))
Confluence Life Sciences
US Patent
LigandPNGBDBM81266(US9695200, 9)
Affinity DataIC50: <1.00E+3nM. Assay description: This assay is based on the binding of a proprietary, Alexa Fluor 647-labeled, ATP-competitive kinase inhibitor (kinase tracer-236) to the ITK express...
In DepthDetails US Patent