BDBM81360 NadD inhibitor 3_17::US8785499, 3_17
SMILES Nc1c(sc2nc(ccc12)-c1ccncc1)C(=O)Nc1cccc(Cl)c1
InChI Key InChIKey=KWJACDFDNBCEHS-UHFFFAOYSA-N
Data  3 IC50
  Tab Delimited (TSV)   2D SDfile   Computed 3D by Vconf -m prep SDfile
Find this compound or compounds like it in BindingDB:
Activity Spreadsheet -- Enzyme Inhibition Constant Data from BindingDB
Found 3 hits for monomerid = 81360
TargetNicotinate-nucleotide adenylyltransferase(Escherichia coli)
Burnham Institute For Medical Research
LigandPNGBDBM81360(NadD inhibitor 3_17 | US8785499, 3_17)
Affinity DataIC50:  1.70E+5nM. Assay description: The enzymatic assay was masured at fixed NaMN and ATP concentration (equal to two-fold km values)with various concentration of inhibitory compounds.
In DepthDetails ArticlePubMed
TargetNicotinate-nucleotide adenylyltransferase(Escherichia coli)
Burnham Institute For Medical Research
LigandPNGBDBM81360(NadD inhibitor 3_17 | US8785499, 3_17)
Affinity DataIC50:  1.70E+5nMpH: 7.5 T: 2°C. Assay description: A general phosphate detection assay method using Malachite Green reagent was adapted to measure the activity of NaMN adenylyltransferaseA14. Briefly,...
In DepthDetails US Patent
TargetProbable nicotinate-nucleotide adenylyltransferase(Bacillus anthracis)
Burnham Institute For Medical Research
LigandPNGBDBM81360(NadD inhibitor 3_17 | US8785499, 3_17)
Affinity DataIC50: >2.00E+5nM. Assay description: The enzymatic assay was masured at fixed NaMN and ATP concentration (equal to two-fold km values)with various concentration of inhibitory compounds.
In DepthDetails ArticlePubMed