BDBM81396 GMX1778
SMILES Clc1ccc(OCCCCCCNC(NC#N)=Nc2ccncc2)cc1
InChI Key InChIKey=BOIPLTNGIAPDBY-UHFFFAOYSA-N
Data  2 IC50
  Tab Delimited (TSV)   2D SDfile   Computed 3D by Vconf -m prep SDfile
Find this compound or compounds like it in BindingDB:
Activity Spreadsheet -- Enzyme Inhibition Constant Data from BindingDB
Found 1 hit for monomerid = 81396
TargetNicotinamide phosphoribosyltransferase(Homo sapiens (Human))
Kyowa Hakko Kogyo
LigandPNGBDBM81396(GMX1778)
Affinity DataIC50:  0.0700nM. Assay description: In vitro inhibition assay using human nampt, NMN adenylytransferase (nmant1)and UDP-glucose dehdryogenase (ugdh) genes.
In DepthDetails ArticlePubMed