BDBM8243 3-[(3-chloro-4-hydroxyphenyl)amino]-4-(2-chlorophenyl)-2,5-dihydro-1H-pyrrole-2,5-dione::4-arylmaleimide deriv. 6z
SMILES Oc1ccc(NC2=C(C(=O)NC2=O)c2ccccc2Cl)cc1Cl
InChI Key InChIKey=TVXWKAUMIVTQTA-UHFFFAOYSA-N
Data  2 KI  2 IC50
  Tab Delimited (TSV)   2D SDfile   Computed 3D by Vconf -m prep SDfile
Find this compound or compounds like it in BindingDB:
Activity Spreadsheet -- Enzyme Inhibition Constant Data from BindingDB
Found 4 hits for monomerid = 8243
TargetSTE20-like serine/threonine-protein kinase(Homo sapiens (Human))
University Of Campinas (Unicamp)
Curated by ChEMBL
LigandPNGBDBM8243(3-[(3-chloro-4-hydroxyphenyl)amino]-4-(2-chlorophe...)
Affinity DataKi:  17nM. Assay description: Binding affinity human SLK by binding displacement assay
In DepthDetails ArticlePubMed
TargetSerine/threonine-protein kinase 10(Homo sapiens (Human))
University Of Campinas (Unicamp)
Curated by ChEMBL
LigandPNGBDBM8243(3-[(3-chloro-4-hydroxyphenyl)amino]-4-(2-chlorophe...)
Affinity DataKi:  150nM. Assay description: Binding affinity human STK10 by binding displacement assay
In DepthDetails ArticlePubMed
TargetGlycogen synthase kinase-3 alpha(Homo sapiens (Human))
Smithkline Beecham Pharmaceuticals
LigandPNGBDBM8243(3-[(3-chloro-4-hydroxyphenyl)amino]-4-(2-chlorophe...)
Affinity DataIC50:  152nM. Assay description: The biochemical activity of compounds was determined by incubation with specific enzyme and substrate in the presence 10 uM ATP/ [gamma-33P] ATP. Aft...
In DepthDetails ArticlePubMed
TargetGlycogen synthase kinase-3 beta(Homo sapiens (Human))
University Of Jordan
Curated by ChEMBL
LigandPNGBDBM8243(3-[(3-chloro-4-hydroxyphenyl)amino]-4-(2-chlorophe...)
Affinity DataIC50:  152nM. Assay description: Inhibition of recombinant GSK3-beta
In DepthDetails ArticlePubMed