BDBM8318 N-[5-(2-chlorophenyl)-1H-pyrazolo[3,4-b]pyridin-3-yl]butanamide::pyrazolopyridine deriv. 21
SMILES CCCC(=O)Nc1n[nH]c2ncc(cc12)-c1ccccc1Cl
InChI Key InChIKey=MFXBFPQUOABRHL-UHFFFAOYSA-N
Data  2 IC50
  Tab Delimited (TSV)   2D SDfile   Computed 3D by Vconf -m prep SDfile
Find this compound or compounds like it in BindingDB:
Activity Spreadsheet -- Enzyme Inhibition Constant Data from BindingDB
Found 1 hit for monomerid = 8318
TargetGlycogen synthase kinase-3 alpha(Homo sapiens (Human))
Glaxosmithkline
LigandPNGBDBM8318(N-[5-(2-chlorophenyl)-1H-pyrazolo[3,4-b]pyridin-3-...)
Affinity DataIC50:  27nM. Assay description: The biochemical activity of compounds was determined by incubation with specific enzyme and substrate in the presence 10 uM ATP/ [gamma-33P] ATP. Aft...
In DepthDetails ArticlePubMed