BDBM83276 MLS002702141::SMR001565706::[(1E,3E)-4-(benzenesulfonyl)buta-1,3-dienyl]sulfonylbenzene::[(1E,3E)-4-(phenylsulfonyl)buta-1,3-dienyl]sulfonylbenzene::[(1E,3E)-4-besylbuta-1,3-dienyl]sulfonylbenzene::cid_5468033
SMILES O=S(=O)(\C=C\C=C\S(=O)(=O)c1ccccc1)c1ccccc1
InChI Key InChIKey=DEXCOBKOWPYHFL-FNCQTZNRSA-N
Data  3 IC50
  Tab Delimited (TSV)   2D SDfile   Computed 3D by Vconf -m prep SDfile
Find this compound or compounds like it in BindingDB:
Activity Spreadsheet -- Enzyme Inhibition Constant Data from BindingDB
Found 1 hit for monomerid = 83276
TargetToll-like receptor 9(Homo sapiens (Human))
The Scripps Research Institute Molecular Screening Center
Curated by PubChem BioAssay
LigandPNGBDBM83276(MLS002702141 | SMR001565706 | [(1E,3E)-4-(benzenes...)
Affinity DataIC50:  160nM
Ligand InfoPC cidPC sid
In DepthDetails PCBioAssay