BDBM8385 CHEMBL421207::N-[6-(furan-2-yl)-1H-indazol-3-yl]cyclopropanecarboxamide::indazole analogue 27
SMILES O=C(Nc1n[nH]c2cc(ccc12)-c1ccco1)C1CC1
InChI Key InChIKey=IJMSMJUUYYSKBT-UHFFFAOYSA-N
Data  3 IC50
  Tab Delimited (TSV)   2D SDfile   Computed 3D by Vconf -m prep SDfile
Find this compound or compounds like it in BindingDB:
Activity Spreadsheet -- Enzyme Inhibition Constant Data from BindingDB
Found 3 hits for monomerid = 8385
TargetGlycogen synthase kinase-3 alpha(Homo sapiens (Human))
Glaxosmithkline
LigandPNGBDBM8385(CHEMBL421207 | N-[6-(furan-2-yl)-1H-indazol-3-yl]c...)
Affinity DataIC50:  50nMpH: 7.0 T: 2°C. Assay description: The biochemical activity of compounds was determined by incubation with specific enzyme and substrate in the presence 10 uM ATP/ [gamma-33P] ATP. Aft...
In DepthDetails ArticlePubMed
TargetCyclin-dependent kinase 2(Homo sapiens (Human))
National Institute Of Pharmaceutical Education And Research
Curated by ChEMBL
LigandPNGBDBM8385(CHEMBL421207 | N-[6-(furan-2-yl)-1H-indazol-3-yl]c...)
Affinity DataIC50:  631nM. Assay description: Inhibition of CDK2 (unknown origin)
In DepthDetails ArticlePubMed
TargetCyclin-A2/Cyclin-dependent kinase 2(Homo sapiens (Human))
Glaxosmithkline
LigandPNGBDBM8385(CHEMBL421207 | N-[6-(furan-2-yl)-1H-indazol-3-yl]c...)
Affinity DataIC50:  631nM. Assay description: In vitro kinase assay using purified CDK2/Cyclin A was incubated at room temperature with substrate, and test compounds in the presence of 100 uM ATP...
In DepthDetails ArticlePubMed