BDBM8387 CHEMBL318522::N-[6-(thiophen-2-yl)-1H-indazol-3-yl]cyclopropanecarboxamide::indazole analogue 29
SMILES O=C(Nc1n[nH]c2cc(ccc12)-c1cccs1)C1CC1
InChI Key InChIKey=GWTAEVKZCDFFEX-UHFFFAOYSA-N
Data  4 IC50
  Tab Delimited (TSV)   2D SDfile   Computed 3D by Vconf -m prep SDfile
Find this compound or compounds like it in BindingDB:
Activity Spreadsheet -- Enzyme Inhibition Constant Data from BindingDB
Found 4 hits for monomerid = 8387
TargetGlycogen synthase kinase-3 alpha(Homo sapiens (Human))
Glaxosmithkline
LigandPNGBDBM8387(CHEMBL318522 | N-[6-(thiophen-2-yl)-1H-indazol-3-y...)
Affinity DataIC50:  215nM. Assay description: The biochemical activity of compounds was determined by incubation with specific enzyme and substrate in the presence 10 uM ATP/ [gamma-33P] ATP. Aft...
In DepthDetails ArticlePubMed
TargetGlycogen synthase kinase-3 beta(Homo sapiens (Human))
University Of Jordan
Curated by ChEMBL
LigandPNGBDBM8387(CHEMBL318522 | N-[6-(thiophen-2-yl)-1H-indazol-3-y...)
Affinity DataIC50:  215nM. Assay description: Inhibition of recombinant GSK3-beta
In DepthDetails ArticlePubMed
TargetCyclin-dependent kinase 2(Homo sapiens (Human))
National Institute Of Pharmaceutical Education And Research
Curated by ChEMBL
LigandPNGBDBM8387(CHEMBL318522 | N-[6-(thiophen-2-yl)-1H-indazol-3-y...)
Affinity DataIC50:  341nM. Assay description: Inhibition of CDK2 (unknown origin)
In DepthDetails ArticlePubMed
TargetCyclin-A2/Cyclin-dependent kinase 2(Homo sapiens (Human))
Glaxosmithkline
LigandPNGBDBM8387(CHEMBL318522 | N-[6-(thiophen-2-yl)-1H-indazol-3-y...)
Affinity DataIC50:  341nM. Assay description: In vitro kinase assay using purified CDK2/Cyclin A was incubated at room temperature with substrate, and test compounds in the presence of 100 uM ATP...
In DepthDetails ArticlePubMed