BDBM88383 US9695131, 20
SMILES COc1ccc(cc1OC)-n1cc(-c2nnn[nH]2)c(=O)n(Cc2cccc(c2C)C(F)(F)F)c1=O
InChI Key InChIKey=ZMBHNMGPLIRHIE-UHFFFAOYSA-N
Data  1 IC50
  Tab Delimited (TSV)   2D SDfile   Computed 3D by Vconf -m prep SDfile
Find this compound or compounds like it in BindingDB:
Activity Spreadsheet -- Enzyme Inhibition Constant Data from BindingDB
Found 1 hit for monomerid = 88383
Targetchymase(Mesocricetus auratus (Golden hamster))
Bayer Pharma Aktiengesellschaft
US Patent
LigandPNGBDBM88383(US9695131, 20)
Affinity DataIC50:  22nMpH: 7.5Assay Description:The enzyme source used is recombinant human chymase (expressed in HEK293 cells) or chymase purified from hamsters' tongues. The substrate used for ch...
In DepthDetails US Patent