BDBM89224 6-(2-furanyl)-[1,2,4]triazolo[4,3-a]pyridine::6-(2-furyl)-[1,2,4]triazolo[4,3-a]pyridine::6-(furan-2-yl)-[1,2,4]triazolo[4,3-a]pyridine::MLS003124514::SMR001285942::cid_49789308
SMILES c1coc(c1)-c1ccc2nncn2c1
InChI Key InChIKey=NRFAFIWUINYRTD-UHFFFAOYSA-N
Data  6 IC50
  Tab Delimited (TSV)   2D SDfile   Computed 3D by Vconf -m prep SDfile
Find this compound or compounds like it in BindingDB:
Activity Spreadsheet -- Enzyme Inhibition Constant Data from BindingDB
Found 6 hits for monomerid = 89224
TargetDNA (cytosine-5)-methyltransferase 1(Homo sapiens (Human))
Burnham Center For Chemical Genomics
Curated by PubChem BioAssay
LigandPNGBDBM89224(6-(2-furanyl)-[1,2,4]triazolo[4,3-a]pyridine | 6-(...)
Affinity DataIC50:  4.58E+3nM. Assay description: Data Source: Sanford-Burnham Center for Chemical Genomics (SBCCG) Source Affiliation: Sanford-Burnham Medical Research Institute (SBMRI, San Diego, C...
Ligand InfoPC cidPC sid
In DepthDetails PCBioAssay
TargetAlbumin(Bos taurus)
The Scripps Research Institute Molecular Screening Center
Curated by PubChem BioAssay
LigandPNGBDBM89224(6-(2-furanyl)-[1,2,4]triazolo[4,3-a]pyridine | 6-(...)
Affinity DataIC50: >9.42E+4nM
Ligand InfoPC cidPC sid
In DepthDetails PCBioAssay
TargetPC4 and SFRS1-interacting protein(Homo sapiens (Human))
The Scripps Research Institute Molecular Screening Center
Curated by PubChem BioAssay
LigandPNGBDBM89224(6-(2-furanyl)-[1,2,4]triazolo[4,3-a]pyridine | 6-(...)
Affinity DataIC50:  1.18E+3nM. Assay description: Source (MLPCN Center Name): The Scripps Research Institute Molecular Screening Center (SRIMSC) Affiliation: Ohio State University Assay Provider: Mam...
Ligand InfoPC cidPC sid
In DepthDetails PCBioAssay
TargetT cell receptor alpha variable 4(Homo sapiens (Human))
The Scripps Research Institute Molecular Screening Center
Curated by PubChem BioAssay
LigandPNGBDBM89224(6-(2-furanyl)-[1,2,4]triazolo[4,3-a]pyridine | 6-(...)
Affinity DataIC50:  3.91E+4nM
Ligand InfoPC cidPC sid
In DepthDetails PCBioAssay
TargetPC4 and SFRS1-interacting protein(Homo sapiens (Human))
The Scripps Research Institute Molecular Screening Center
Curated by PubChem BioAssay
LigandPNGBDBM89224(6-(2-furanyl)-[1,2,4]triazolo[4,3-a]pyridine | 6-(...)
Affinity DataIC50:  1.50E+4nM. Assay description: Source (MLPCN Center Name): The Scripps Research Institute Molecular Screening Center (SRIMSC) Affiliation: Ohio State University Assay Provider: Mam...
Ligand InfoPC cidPC sid
In DepthDetails PCBioAssay
TargetHuntingtin(Homo sapiens (Human))
The Scripps Research Institute Molecular Screening Center
Curated by PubChem BioAssay
LigandPNGBDBM89224(6-(2-furanyl)-[1,2,4]triazolo[4,3-a]pyridine | 6-(...)
Affinity DataIC50:  2.78E+3nM
Ligand InfoPC cidPC sid
In DepthDetails PCBioAssay