BDBM91874 US10189794, Compound I-73::US10618902, Compound I-73::US10774052, Compound I-73::US9695132, I-73
SMILES COc1cc(OC)c(Cl)c(N2Cc3cnc(NC4CCCCC4NC(=O)C=C)nc3NC2=O)c1Cl
InChI Key InChIKey=UCWYPNRWSPOUKY-UHFFFAOYSA-N
Data  4 IC50
  Tab Delimited (TSV)   2D SDfile   Computed 3D by Vconf -m prep SDfile
Find this compound or compounds like it in BindingDB:
Activity Spreadsheet -- Enzyme Inhibition Constant Data from BindingDB
Found 1 hit for monomerid = 91874
TargetFibroblast growth factor receptor 4(Homo sapiens (Human))
Celgene Car
US Patent
LigandPNGBDBM91874(US10189794, Compound I-73 | US10618902, Compound I...)
Affinity DataIC50:  300nM. Assay description: For MDA-MB-453 cells signaling, cells were grown in 96-well poly-D-lysine plates (BD Bioscience, San Jose, Calif.) to 90% confluence, and were then i...
In DepthDetails US Patent