BDBM92803 Bisanilinopyrimidine, 3r::US9249124, 19
SMILES OC(=O)c1cccc(Nc2ncc(F)c(Nc3ccccc3C(O)=O)n2)c1
InChI Key InChIKey=ZMDAPBTWJIUZLR-UHFFFAOYSA-N
Data  2 IC50
  Tab Delimited (TSV)   2D SDfile   Computed 3D by Vconf -m prep SDfile
Find this compound or compounds like it in BindingDB:
Activity Spreadsheet -- Enzyme Inhibition Constant Data from BindingDB
Found 2 hits for monomerid = 92803
TargetAurora kinase A(Homo sapiens (Human))
H. Lee Moffitt Cancer Center and Research Institute
US Patent
LigandPNGBDBM92803(Bisanilinopyrimidine, 3r | US9249124, 19)
Affinity DataIC50:  5.10nMpH: 7.4 T: 2°C. Assay description: Reactions were carried out at room temperature in 15 mM HEPES buffer (pH 7.4) containing 20 mM NaCl, 1 mM EGTA, 0.02% Tween 20, 10 mM MgCl2, 5% (v/v)...
In DepthDetails US Patent
TargetAurora kinase A(Homo sapiens (Human))
H. Lee Moffitt Cancer Center and Research Institute
US Patent
LigandPNGBDBM92803(Bisanilinopyrimidine, 3r | US9249124, 19)
Affinity DataIC50:  5.10nM. Assay description: In vitro enzyme activity assay using Aurora Kinase A.
In DepthDetails ArticlePubMed