BDBM95282 4-phenyl-N-[2-(4-sulfamoylphenyl)ethyl]benzamide::MLS001181416::SMR000503014::cid_2904040
SMILES NS(=O)(=O)c1ccc(CCNC(=O)c2ccc(cc2)-c2ccccc2)cc1
InChI Key InChIKey=OZSQEXWJFGWJHY-UHFFFAOYSA-N
Data  3 IC50
  Tab Delimited (TSV)   2D SDfile   Computed 3D by Vconf -m prep SDfile
Find this compound or compounds like it in BindingDB:
Activity Spreadsheet -- Enzyme Inhibition Constant Data from BindingDB
Found 1 hit for monomerid = 95282
TargetEnvelope glycoprotein gp160(Human immunodeficiency virus type 1 group M subtyp...)
The Scripps Research Institute Molecular Screening Center
Curated by PubChem BioAssay
LigandPNGBDBM95282(4-phenyl-N-[2-(4-sulfamoylphenyl)ethyl]benzamide |...)
Affinity DataIC50: >6.71E+4nM
In DepthDetails PCBioAssay