BDBM95318 MLS000040751::SMR000043586::[1-[(E)-(2,3-dimethoxybenzylidene)amino]benzimidazol-2-yl]methanol::[1-[(E)-(2,3-dimethoxyphenyl)methylideneamino]-2-benzimidazolyl]methanol::[1-[(E)-(2,3-dimethoxyphenyl)methylideneamino]benzimidazol-2-yl]methanol::cid_6859187
SMILES COc1cccc(\C=N\n2c(CO)nc3ccccc23)c1OC
InChI Key InChIKey=VXUQCUCIVDKXCG-VCHYOVAHSA-N
Data  1 IC50
  Tab Delimited (TSV)   2D SDfile   Computed 3D by Vconf -m prep SDfile
Find this compound or compounds like it in BindingDB:
Activity Spreadsheet -- Enzyme Inhibition Constant Data from BindingDB
Found 1 hit for monomerid = 95318
TargetMitochondrial peptide methionine sulfoxide reductase(Bos taurus)
The Scripps Research Institute Molecular Screening Center
Curated by PubChem BioAssay
LigandPNGBDBM95318(MLS000040751 | SMR000043586 | [1-[(E)-(2,3-dimetho...)
Affinity DataIC50: >1.55E+5nM
In DepthDetails PCBioAssay