BDBM98023 US8486966, 20
SMILES C[C@H](Nc1nc(NC2CCOCC2)c2ncn(-c3cc(C)[nH]n3)c2n1)c1ccc(F)cn1
InChI Key InChIKey=NLMBGKWBMKWILA-ZDUSSCGKSA-N
Data  1 IC50
  Tab Delimited (TSV)   2D SDfile   Computed 3D by Vconf -m prep SDfile
Find this compound or compounds like it in BindingDB:
Activity Spreadsheet -- Enzyme Inhibition Constant Data from BindingDB
Found 1 hit for monomerid = 98023
TargetHigh affinity nerve growth factor receptor(Homo sapiens (Human))
Astrazeneca
US Patent
LigandPNGBDBM98023(US8486966, 20)
Affinity DataIC50:  475nMT: 2°C. Assay description: JAK2 and Trk A kinase activity was determined by measuring the kinase's ability to phoshorylate synthetic tyrosine residues within a generic poly...
In DepthDetails US Patent