BDBM98807 US9695200, 37
SMILES COc1cc(ccn1)-c1c[nH]c2ncc(cc12)-c1cccc(NC(=O)\C=C\CN(C)C)c1
InChI Key InChIKey=ZOSSKLADZPTDAW-VMPITWQZSA-N
Data  2 IC50
  Tab Delimited (TSV)   2D SDfile   Computed 3D by Vconf -m prep SDfile
Find this compound or compounds like it in BindingDB:
Activity Spreadsheet -- Enzyme Inhibition Constant Data from BindingDB
Found 2 hits for monomerid = 98807
Target1-phosphatidylinositol 4,5-bisphosphate phosphodiesterase gamma-1(Homo sapiens (Human))
Confluence Life Sciences
US Patent
LigandPNGBDBM98807(US9695200, 37)
Affinity DataIC50:  3.00E+3nMT: 2°C. Assay description: Compounds were serially diluted into DMSO, and then into media to concentrations 10× that of the final assay concentration. Compounds were then added...
Ligand InfoPC cidPC sid
In DepthDetails US Patent
TargetTyrosine-protein kinase ITK/TSK(Homo sapiens (Human))
Confluence Life Sciences
US Patent
LigandPNGBDBM98807(US9695200, 37)
Affinity DataIC50: <1.00E+3nM. Assay description: This assay is based on the binding of a proprietary, Alexa Fluor 647-labeled, ATP-competitive kinase inhibitor (kinase tracer-236) to the ITK express...
Ligand InfoPC cidPC sid
In DepthDetails US Patent