BDBM98815 US9695200, 40
SMILES COc1cc(ccn1)-c1c[nH]c2ncc(cc12)-c1cc(NC(=O)C=C)nc(OC)c1
InChI Key InChIKey=BKNMXXWIGJXIID-UHFFFAOYSA-N
Data  1 IC50
  Tab Delimited (TSV)   2D SDfile   Computed 3D by Vconf -m prep SDfile
Find this compound or compounds like it in BindingDB:
Activity Spreadsheet -- Enzyme Inhibition Constant Data from BindingDB
Found 1 hit for monomerid = 98815
TargetTyrosine-protein kinase ITK/TSK(Homo sapiens (Human))
Confluence Life Sciences
US Patent
LigandPNGBDBM98815(US9695200, 40)
Affinity DataIC50: <1.00E+3nM. Assay description: This assay is based on the binding of a proprietary, Alexa Fluor 647-labeled, ATP-competitive kinase inhibitor (kinase tracer-236) to the ITK express...
Ligand InfoPC cidPC sid
In DepthDetails US Patent