BDBM9971 (8S)-2,8,15-trimethyltetracyclo[8.7.0.0^{2,7}.0^{11,15}]heptadec-6-en-14-ol::6-Substituted Androst-4-ene Analog 14a
SMILES C[C@H]1CC2C3CCC(O)C3(C)CCC2C2(C)CCCC=C12
InChI Key InChIKey=SNJUIXSSEIVANC-SSSDRFAOSA-N
Data  1 KI  1 IC50
  Tab Delimited (TSV)   2D SDfile   Computed 3D by Vconf -m prep SDfile
Find this compound or compounds like it in BindingDB:
Activity Spreadsheet -- Enzyme Inhibition Constant Data from BindingDB
Found 1 hit for monomerid = 9971
TargetAromatase(Homo sapiens (Human))
Tohoku College of Pharmacy
LigandPNGBDBM9971((8S)-2,8,15-trimethyltetracyclo[8.7.0.0^{2,7}.0^{1...)
Affinity DataKi:  380nM IC50:  3.70E+3nM. Assay description: The enzyme activity was assayed by measuring the 3H-labeled H2O formed from [1beta-3H] Androstenedione during aromatization. After incubation, the re...
In DepthDetails ArticlePubMed