Target
Metabotropic glutamate receptor 5
Ligand
BDBM222818
Substrate
Meas. Tech.
MPEP Binding Assay
EC50
18.0±n/a nM
Citation
 Jaeschke, GLindemann, LRicci, AVieira, E Ethynyl derivatives US Patent  US11059766 Publication Date 7/13/2021 
Target
Name:
Metabotropic glutamate receptor 5
Synonyms:
GPRC1E GRM5_HUMAN metabotropic glutamate 5 | metabotropic glutamate 5a
Type:
Enzyme
Mol. Mass.:
132484.72
Organism:
Homo sapiens (Human)
Description:
Residue:
1212
  
Inhibitor
Name:
BDBM222818
Synonyms:
US11059766, WO2011128279 Ex. 109 | US9315498, 109
Type:
Small organic molecule
Emp. Form.:
C20H18FN3O
Mol. Mass.:
335.3748
SMILES:
CN1[C@H]2CCC[C@H]2N(C1=O)c1ccc(cn1)C#Cc1cccc(F)c1
: