Target
Tyrosine-protein kinase JAK3
Ligand
BDBM316514
Substrate
Meas. Tech.
Caliper Enzyme Assay (4 uM ATP)
IC50
0.200±n/a nM
Citation
 Thorarensen, ABrown, MFCasimiro-Garcia, AChe, YCoe, JWFlanagan, MEGilbert, AMHayward, MMLangille, JDMontgomery, JITelliez, JUnwalla, RJTrujillo, JI Pyrrolo[2,3-d]pyrimidinyl, pyrrolo[2,3-b]pyrazinyl and pyrrolo[2,3-d]pyridinyl acrylamides US Patent  US11111242 Publication Date 9/7/2021 
Target
Name:
Tyrosine-protein kinase JAK3
Synonyms:
JAK-3 JAK3_HUMAN Janus kinase 3 (JAK3) L-JAK | Leukocyte janus kinase
Type:
Protein
Mol. Mass.:
125111.08
Organism:
Homo sapiens (Human)
Description:
P52333
Residue:
1124
  
Inhibitor
Name:
BDBM316514
Synonyms:
US11111242, Example 2 | US9617258, Example 2
Type:
Small organic molecule
Emp. Form.:
C15H17ClN4O
Mol. Mass.:
304.775
SMILES:
Clc1c[nH]c2nccc(N[C@@H]3CCCN(C3)C(=O)C=C)c12
: