Target
Tyrosine-protein kinase JAK3
Ligand
BDBM209866
Substrate
Meas. Tech.
Caliper Enzyme Assay (4 uM ATP)
IC50
0.300±n/a nM
Citation
 Thorarensen, ABrown, MFCasimiro-Garcia, AChe, YCoe, JWFlanagan, MEGilbert, AMHayward, MMLangille, JDMontgomery, JITelliez, JUnwalla, RJTrujillo, JI Pyrrolo[2,3-d]pyrimidinyl, pyrrolo[2,3-b]pyrazinyl and pyrrolo[2,3-d]pyridinyl acrylamides US Patent  US11111242 Publication Date 9/7/2021 
Target
Name:
Tyrosine-protein kinase JAK3
Synonyms:
JAK-3 JAK3_HUMAN Janus kinase 3 (JAK3) L-JAK | Leukocyte janus kinase
Type:
Protein
Mol. Mass.:
125111.08
Organism:
Homo sapiens (Human)
Description:
P52333
Residue:
1124
  
Inhibitor
Name:
BDBM209866
Synonyms:
PF-06651600 US20230348487, Example PF-06651600 | US9617258, Example 5
Type:
Small organic molecule
Emp. Form.:
C15H19N5O
Mol. Mass.:
285.3443
SMILES:
C[C@H]1CC[C@H](CN1C(=O)C=C)Nc1ncnc2[nH]ccc12
: