Target
Tyrosine-protein kinase JAK3
Ligand
BDBM316618
Substrate
Meas. Tech.
Caliper Enzyme Assay (4 uM ATP)
IC50
528±n/a nM
Citation
 Thorarensen, ABrown, MFCasimiro-Garcia, AChe, YCoe, JWFlanagan, MEGilbert, AMHayward, MMLangille, JDMontgomery, JITelliez, JUnwalla, RJTrujillo, JI Pyrrolo[2,3-d]pyrimidinyl, pyrrolo[2,3-b]pyrazinyl and pyrrolo[2,3-d]pyridinyl acrylamides US Patent  US11111242 Publication Date 9/7/2021 
Target
Name:
Tyrosine-protein kinase JAK3
Synonyms:
JAK-3 JAK3_HUMAN Janus kinase 3 (JAK3) L-JAK | Leukocyte janus kinase
Type:
Protein
Mol. Mass.:
125111.08
Organism:
Homo sapiens (Human)
Description:
P52333
Residue:
1124
  
Inhibitor
Name:
BDBM316618
Synonyms:
(2E)-4-(dimethylamino)-1-[(3R)-3-{[5-(2-methoxyethyl)-7H-pyrrolo[2,3-d]pyrimidin-4-yl]amino}pipendin-1-yl]but-2-en-1-one US9617258, Example 108
Type:
Small organic molecule
Emp. Form.:
C20H30N6O2
Mol. Mass.:
386.4912
SMILES:
COCCc1c[nH]c2ncnc(N[C@@H]3CCCN(C3)C(=O)\C=C\CN(C)C)c12
: