Target
Tyrosine-protein kinase JAK3
Ligand
BDBM316739
Substrate
Meas. Tech.
Caliper Enzyme Assay (4 uM ATP)
IC50
0.100±n/a nM
Citation
 Thorarensen, ABrown, MFCasimiro-Garcia, AChe, YCoe, JWFlanagan, MEGilbert, AMHayward, MMLangille, JDMontgomery, JITelliez, JUnwalla, RJTrujillo, JI Pyrrolo[2,3-d]pyrimidinyl, pyrrolo[2,3-b]pyrazinyl and pyrrolo[2,3-d]pyridinyl acrylamides US Patent  US11111242 Publication Date 9/7/2021 
Target
Name:
Tyrosine-protein kinase JAK3
Synonyms:
JAK-3 JAK3_HUMAN Janus kinase 3 (JAK3) L-JAK | Leukocyte janus kinase
Type:
Protein
Mol. Mass.:
125111.08
Organism:
Homo sapiens (Human)
Description:
P52333
Residue:
1124
  
Inhibitor
Name:
BDBM316739
Synonyms:
2-[(1-acryloylpiperidin-4-yl)amino]-N-(3,3-difluorocyclohexyl)-5H-pyrrolo[2,3-b]pyrazine-7-carboxamide US9617258, Example 236
Type:
Small organic molecule
Emp. Form.:
C21H26F2N6O2
Mol. Mass.:
432.4669
SMILES:
FC1(F)CCCC(C1)NC(=O)c1c[nH]c2ncc(NC3CCN(CC3)C(=O)C=C)nc12
: