Target
Proto-oncogene tyrosine-protein kinase receptor Ret
Ligand
BDBM296543
Substrate
Meas. Tech.
RET Enzyme Assay
IC50
9.70±n/a nM
Citation
 Andrews, SWAronow, SBlake, JFBrandhuber, BJCook, AHaas, JJiang, YKolakowski, GRMcFaddin, EAMcKenney, MLMcNulty, OTMetcalf, ATMoreno, DATang, TPRen, L Substituted pyrazolo[1,5-a]pyridine compounds as RET kinase inhibitors US Patent  US10137124 Publication Date 11/27/2018 
Target
Name:
Proto-oncogene tyrosine-protein kinase receptor Ret
Synonyms:
CDHF12 Cadherin family member 12 Proto-oncogene c-Ret RET51 Tyrosine-protein kinase Ret (RET)
Type:
Protein
Mol. Mass.:
124318.29
Organism:
Homo sapiens (Human)
Description:
P07949
Residue:
1114
  
Inhibitor
Name:
BDBM296543
Synonyms:
US10112942, Example 277 US10172851, Example 277 US10953005, Example 277
Type:
Small organic molecule
Emp. Form.:
C29H30FN7O3
Mol. Mass.:
543.592
SMILES:
CC(C)(O)COc1cc(-c2ccc(nc2)N2CCN(CC2)C(=O)C(N)c2ccc(F)cc2)c2c(cnn2c1)C#N
: