Target
Proto-oncogene tyrosine-protein kinase receptor Ret
Ligand
BDBM305071
Substrate
Meas. Tech.
RET Enzyme Assay
IC50
5.30±n/a nM
Citation
 Andrews, SWAronow, SBlake, JFBrandhuber, BJCollier, JCook, AHaas, JJiang, YKolakowski, GRMcFaddin, EAMcKenney, MLMcNulty, OTMetcalf, ATMoreno, DARamann, GATang, TPRen, LWalls, SM Substituted pyrazolo[1,5-A]pyridine compounds as RET kinase inhibitors US Patent  US10144734 Publication Date 12/4/2018 
Target
Name:
Proto-oncogene tyrosine-protein kinase receptor Ret
Synonyms:
CDHF12 Cadherin family member 12 Proto-oncogene c-Ret RET51 Tyrosine-protein kinase Ret (RET)
Type:
Protein
Mol. Mass.:
124318.29
Organism:
Homo sapiens (Human)
Description:
P07949
Residue:
1114
  
Inhibitor
Name:
BDBM305071
Synonyms:
US10144734, Example 87 US10441581, Example 87 US11648243, Example 87
Type:
Small organic molecule
Emp. Form.:
C30H32ClN7O3
Mol. Mass.:
574.073
SMILES:
Cc1ncc(Cl)cc1C(=O)NC1(C)CCN(CC1)c1ccc(cn1)-c1cc(OCC(C)(C)O)cn2ncc(C#N)c12
: