Target
Histone deacetylase 2
Ligand
BDBM411364
Substrate
Meas. Tech.
HDAC Enzyme Assay
IC50
255±n/a nM
Citation
 van Duzer, JHMazitschek, R Substituted piperazines as selective HDAC1,2 inhibitors US Patent  US11542242 Publication Date 1/3/2023 
Target
Name:
Histone deacetylase 2
Synonyms:
Cereblon/Histone deacetylase 2 HDAC2 Histone deacetylase 2 (HDAC2) | Human HDAC2
Type:
Chromatin regulator; hydrolase; repressor
Mol. Mass.:
55356.54
Organism:
Homo sapiens (Human)
Description:
Q92769
Residue:
488
  
Inhibitor
Name:
BDBM411364
Synonyms:
US10385031, Compound 070 US11542242, Compound 070
Type:
Small organic molecule
Emp. Form.:
C23H25N5O
Mol. Mass.:
387.4775
SMILES:
CN1CCN(CC1)c1ccc(cn1)C(=O)Nc1cc(ccc1N)-c1ccccc1
: