Target
Histone deacetylase 3
Ligand
BDBM411380
Substrate
Meas. Tech.
HDAC Enzyme Assay
IC50
255±n/a nM
Citation
 van Duzer, JHMazitschek, R Substituted piperazines as selective HDAC1,2 inhibitors US Patent  US11542242 Publication Date 1/3/2023 
Target
Name:
Histone deacetylase 3
Synonyms:
HD3 HDAC3_HUMAN Human HDAC3 SMAP45
Type:
Enzyme
Mol. Mass.:
48829.55
Organism:
Homo sapiens (Human)
Description:
O15379
Residue:
428
  
Inhibitor
Name:
BDBM411380
Synonyms:
US10385031, Compound 086 US11542242, Compound 086
Type:
Small organic molecule
Emp. Form.:
C20H22N6OS
Mol. Mass.:
394.493
SMILES:
CN1CCN(CC1)c1cnc(cn1)C(=O)Nc1cc(ccc1N)-c1cccs1
: