Target
Nuclear receptor ROR-gamma
Ligand
BDBM310102
Substrate
Meas. Tech.
TR-FRET Assay Protocol I
EC50
336±n/a nM
Citation
 Aicher, TDBarr, KJLapointe, BTSimov, VStein, KAThomas, WDToogood, PLVan Huis, CAWhite, CM Tetrahydronaphthyridine and related bicyclic compounds for inhibition of RORγ activity and the treatment of disease US Patent  US9657033 Publication Date 5/23/2017 
Target
Name:
Nuclear receptor ROR-gamma
Synonyms:
NR1F3 Nuclear receptor ROR-gamma (RORC) RAR-related orphan receptor C (RORc) RORG RZRG Retinoid-related orphan receptor-gamma (RORc)
Type:
Enzyme Catalytic Domain
Mol. Mass.:
58218.40
Organism:
Homo sapiens (Human)
Description:
P51449
Residue:
518
  
Inhibitor
Name:
BDBM310102
Synonyms:
(S)-N-(3-(acetamidomethyl)-1-(m-tolylsulfonyl)-2,3-dihydro-1H-pyrido[2,3-b][1,4]oxazin-7-yl)-2-chloro-6-fluorobenzamide US9657033, Compound 16
Type:
Small organic molecule
Emp. Form.:
C24H22ClFN4O5S
Mol. Mass.:
532.972
SMILES:
CC(=O)NC[C@H]1CN(c2cc(NC(=O)c3c(F)cccc3Cl)cnc2O1)S(=O)(=O)c1cccc(C)c1
: