Target
Aromatase
Ligand
BDBM9478
Substrate
BDBM8885
Meas. Tech.
CYP19 Assay
pH
7.4±n/a
Temperature
303.15±n/a K
IC50
680±n/a nM
Citation
 Leonetti, FFavia, ARao, AAliano, RPaluszcak, AHartmann, RWCarotti, A Design, synthesis, and 3D QSAR of novel potent and selective aromatase inhibitors. J Med Chem 47:6792-803 (2004)  
Target
Name:
Aromatase
Synonyms:
ARO1 CP19A_HUMAN CYP19 CYPXIX Cytochrome P450 19A1 Cytochrome P450-C19 (CYP19) FL cytokine receptor precursor | P-450AROM
Type:
Enzyme
Mol. Mass.:
57888.92
Organism:
Homo sapiens (Human)
Description:
P11511
Residue:
503
  
Inhibitor
Name:
BDBM9478
Synonyms:
7-(1H-Imidazol-1-ylmethyl)-2H-chromen-2-one Coumarin deriv. 27
Type:
Small organic molecule
Emp. Form.:
C13H10N2O2
Mol. Mass.:
226.2307
SMILES:
O=c1ccc2ccc(Cn3ccnc3)cc2o1
:
Substrate
Name:
BDBM8885
Synonyms:
(1S,2R,10R,11S,14S,15S)-14-hydroxy-2,15-dimethyltetracyclo[8.7.0.0^{2,7}.0^{11,15}]heptadec-6-en-5-one Testosterone US9682960, Testosterone
Type:
Steroid
Emp. Form.:
C19H28O2
Mol. Mass.:
288.4244
SMILES:
[H][C@@]12CC[C@H](O)[C@@]1(C)CC[C@@]1([H])[C@@]2([H])CCC2=CC(=O)CC[C@]12C
: