Target
Aromatase
Ligand
BDBM8935
Substrate
BDBM8885
Meas. Tech.
CYP19 Assay
pH
7.4±n/a
Temperature
303.15±n/a K
IC50
17000±n/a nM
Citation
 Leonetti, FFavia, ARao, AAliano, RPaluszcak, AHartmann, RWCarotti, A Design, synthesis, and 3D QSAR of novel potent and selective aromatase inhibitors. J Med Chem 47:6792-803 (2004)  
Target
Name:
Aromatase
Synonyms:
ARO1 CP19A_HUMAN CYP19 CYPXIX Cytochrome P450 19A1 Cytochrome P450-C19 (CYP19) FL cytokine receptor precursor | P-450AROM
Type:
Enzyme
Mol. Mass.:
57888.92
Organism:
Homo sapiens (Human)
Description:
P11511
Residue:
503
  
Inhibitor
Name:
BDBM8935
Synonyms:
5-[(6-methoxy-1-methyl-3,4-dihydronaphthalen-2-yl)methyl]-1H-imidazole CHEMBL448463 dihydronaphthalene derivative
Type:
Emp. Form.:
C16H18N2O
Mol. Mass.:
254.3269
SMILES:
COc1ccc2C(C)=C(Cc3cnc[nH]3)CCc2c1
:
Substrate
Name:
BDBM8885
Synonyms:
(1S,2R,10R,11S,14S,15S)-14-hydroxy-2,15-dimethyltetracyclo[8.7.0.0^{2,7}.0^{11,15}]heptadec-6-en-5-one Testosterone US9682960, Testosterone
Type:
Steroid
Emp. Form.:
C19H28O2
Mol. Mass.:
288.4244
SMILES:
[H][C@@]12CC[C@H](O)[C@@]1(C)CC[C@@]1([H])[C@@]2([H])CCC2=CC(=O)CC[C@]12C
: