Target
Genome polyprotein
Ligand
BDBM9680
Substrate
NS3-NS4A Chromogenic Peptide Substrate
Meas. Tech.
Continuous Spectrophotometric Assay
pH
6.5±n/a
Temperature
303.15±n/a K
Ki
26±n/a nM
Km
19000±1000 nM
Comments
The substrate is hydrolyzed by HCV protease with a second-order rate constant (kcat/Km) of 80,000 +/- 10,000 M-1sec-1.
Citation
 Bogen, SLArasappan, ABennett, FChen, KJao, ELiu, YTLovey, RGVenkatraman, SPan, WParekh, TPike, RERuan, SLiu, RBaroudy, BAgrawal, SChase, RIngravallo, PPichardo, JProngay, ABrisson, JMHsieh, TYCheng, KCKemp, SJLevy, OELim-Wilby, MTamura, SYSaksena, AKGirijavallabhan, VNjoroge, FG Discovery of SCH446211 (SCH6): a new ketoamide inhibitor of the HCV NS3 serine protease and HCV subgenomic RNA replication. J Med Chem 49:2750-7 (2006)  
Target
Name:
Genome polyprotein
Synonyms:
Dipeptidyl peptidase 4 (DPP4) NS3 NS5B NS3-4A Protease NS3/4A protease POLG_HCV77 | RNA polymerase (NS5B)
Type:
Protease Domain
Mol. Mass.:
327221.49
Organism:
Hepatitis C virus (HCV genotype 1a, isolate H)
Description:
P27958
Residue:
3011
  
Inhibitor
Name:
BDBM9680
Synonyms:
2-methylpropyl N-[(1S)-1-cyclohexyl-2-[(8S)-8-({1-[({[(S)-(dimethylcarbamoyl)(phenyl)methyl]carbamoyl}methyl)carbamoyl]-1-oxopentan-2-yl}carbamoyl)-1,4-dithia-7-azaspiro[4.4]nonan-7-yl]-2-oxoethyl]carbamate | SCH446211 (SCH6) Analog 13
Type:
Small organic molecule
Emp. Form.:
C38H56N6O8S2
Mol. Mass.:
789.017
SMILES:
CCCC(NC(=O)[C@@H]1C[C@@]2(CN1C(=O)[C@@H](NC(=O)OCC(C)C)C1CCCCC1)SCCS2)C(=O)C(=O)NCC(=O)N[C@H](C(=O)N(C)C)c1ccccc1
:
Substrate
Name:
NS3-NS4A Chromogenic Peptide Substrate
Synonyms:
Type:
Peptide
Mol. Mass.:
1366.94
Organism:
Description:
The 4-phenylazophenol (PAP) chromophore was incorporated to improve assay sensitivity.
Residue:
13
ACDTEDVVPNVAH