Target
Genome polyprotein
Ligand
BDBM9688
Substrate
NS3-NS4A Chromogenic Peptide Substrate
Meas. Tech.
Continuous Spectrophotometric Assay
pH
6.5±n/a
Temperature
303.15±n/a K
Ki
14±n/a nM
Km
19000±1000 nM
Comments
The substrate is hydrolyzed by HCV protease with a second-order rate constant (kcat/Km) of 80,000 +/- 10,000 M-1sec-1.
Citation
 Bogen, SLArasappan, ABennett, FChen, KJao, ELiu, YTLovey, RGVenkatraman, SPan, WParekh, TPike, RERuan, SLiu, RBaroudy, BAgrawal, SChase, RIngravallo, PPichardo, JProngay, ABrisson, JMHsieh, TYCheng, KCKemp, SJLevy, OELim-Wilby, MTamura, SYSaksena, AKGirijavallabhan, VNjoroge, FG Discovery of SCH446211 (SCH6): a new ketoamide inhibitor of the HCV NS3 serine protease and HCV subgenomic RNA replication. J Med Chem 49:2750-7 (2006)  
Target
Name:
Genome polyprotein
Synonyms:
Dipeptidyl peptidase 4 (DPP4) NS3 NS5B NS3-4A Protease NS3/4A protease POLG_HCV77 | RNA polymerase (NS5B)
Type:
Protease Domain
Mol. Mass.:
327221.49
Organism:
Hepatitis C virus (HCV genotype 1a, isolate H)
Description:
P27958
Residue:
3011
  
Inhibitor
Name:
BDBM9688
Synonyms:
SCH446211 (SCH6) Analog 21 | tert-butyl N-[(2S)-1-[(1R,2S,5S)-2-({1-[({[(S)-(dimethylcarbamoyl)(phenyl)methyl]carbamoyl}methyl)carbamoyl]-1-oxopentan-2-yl}carbamoyl)-6,6-dimethyl-3-azabicyclo[3.1.0]hexan-3-yl]-3,3-dimethyl-1-oxobutan-2-yl]carbamate
Type:
Small organic molecule
Emp. Form.:
C37H56N6O8
Mol. Mass.:
712.8759
SMILES:
CCCC(NC(=O)[C@@H]1[C@@H]2[C@H](CN1C(=O)[C@@H](NC(=O)OC(C)(C)C)C(C)(C)C)C2(C)C)C(=O)C(=O)NCC(=O)N[C@H](C(=O)N(C)C)c1ccccc1
:
Substrate
Name:
NS3-NS4A Chromogenic Peptide Substrate
Synonyms:
Type:
Peptide
Mol. Mass.:
1366.94
Organism:
Description:
The 4-phenylazophenol (PAP) chromophore was incorporated to improve assay sensitivity.
Residue:
13
ACDTEDVVPNVAH