Target
cAMP and cAMP-inhibited cGMP 3',5'-cyclic phosphodiesterase 10A [440-779]
Ligand
BDBM173107
Substrate
Meas. Tech.
PDE10A Inhibition Assay
Temperature
298.15±n/a K
IC50
130±n/a nM
Comments
extracted
Citation
 Püschl, ANielsen, JKehler, JKilburn, JPMarigo, MLanggård, M Heteroaromatic phenylimidazole derivatives as PDE10A enzyme inhibitors US Patent  US9669029 Publication Date 6/6/2017 
Target
Name:
cAMP and cAMP-inhibited cGMP 3',5'-cyclic phosphodiesterase 10A [440-779]
Synonyms:
PDE10A PED10A | Phosphodiesterase 10A (PDE10A)
Type:
Mol. Mass.:
39060.01
Organism:
Homo sapiens (Human)
Description:
Q9Y233[440-779]
Residue:
340
  
Inhibitor
Name:
BDBM173107
Synonyms:
US9096589, 2-{2-[1-(2-Methoxy-ethyl)-4-thiophen-2-yl-1H-imidazol-2-yl]-ethyl}-5,7-dimethyl-imidazo[1,2-a]pyrimidine | US9669029, 28 2-{2-[1-(2-Methoxy-ethyl)-4-thiophen-2-yl-1H-imidazol-2-yl]-ethyl}-5,7-dimethyl-imidazo[1,2-a]pyrimidine
Type:
Small organic molecule
Emp. Form.:
C20H23N5OS
Mol. Mass.:
381.495
SMILES:
COCCn1cc(nc1CCc1cn2c(C)cc(C)nc2n1)-c1cccs1
: