Target
Alpha-1A adrenergic receptor
Ligand
BDBM317594
Substrate
Meas. Tech.
Binding Assay
IC50
36.0±n/a nM
Citation
 Becker-Pelster, EMBuchgraber, PBuchmüller, AEngel, KGöller, AHimmel, HKast, RKeldenich, JSchmeck, CTinel, HWunder, F Substituted bipiperidinyl derivatives US Patent  US9624199 Publication Date 4/18/2017 
Target
Name:
Alpha-1A adrenergic receptor
Synonyms:
ADA1A_HUMAN ADRA1C Alpha 1A-adrenoceptor Alpha adrenergic receptor 1a Alpha-adrenergic receptor 1c adrenergic Alpha1 | adrenergic Alpha1C
Type:
Cell-surface receptors
Mol. Mass.:
51511.67
Organism:
Homo sapiens (Human)
Description:
P35348
Residue:
466
  
Inhibitor
Name:
BDBM317594
Synonyms:
US9624199, 4 | {6-[(2-Methoxyethyl)amino]pyridin-3-yl}[(3R)-3-methyl-1,4′-bipiperidin-1′-yl]methanone
Type:
Small organic molecule
Emp. Form.:
C20H32N4O2
Mol. Mass.:
360.4937
SMILES:
COCCNc1ccc(cn1)C(=O)N1CCC(CC1)N1CCC[C@@H](C)C1
: