Target
Alpha-1A adrenergic receptor
Ligand
BDBM317598
Substrate
Meas. Tech.
Binding Assay
IC50
4.50±n/a nM
Citation
 Becker-Pelster, EMBuchgraber, PBuchmüller, AEngel, KGöller, AHimmel, HKast, RKeldenich, JSchmeck, CTinel, HWunder, F Substituted bipiperidinyl derivatives US Patent  US9624199 Publication Date 4/18/2017 
Target
Name:
Alpha-1A adrenergic receptor
Synonyms:
ADA1A_HUMAN ADRA1C Alpha 1A-adrenoceptor Alpha adrenergic receptor 1a Alpha-adrenergic receptor 1c adrenergic Alpha1 | adrenergic Alpha1C
Type:
Cell-surface receptors
Mol. Mass.:
51511.67
Organism:
Homo sapiens (Human)
Description:
P35348
Residue:
466
  
Inhibitor
Name:
BDBM317598
Synonyms:
US9624199, 8 | {6-[(2,6-Difluorobenzyl)(methyl)amino]pyridin-3-yl}[(3R)-3-methyl-1,4′-bipiperidin-1′-yl]methanone
Type:
Small organic molecule
Emp. Form.:
C25H32F2N4O
Mol. Mass.:
442.5446
SMILES:
C[C@@H]1CCCN(C1)C1CCN(CC1)C(=O)c1ccc(nc1)N(C)Cc1c(F)cccc1F
: