Target
Dipeptidyl peptidase 4
Ligand
BDBM11144
Substrate
BDBM11057
Meas. Tech.
Dipeptidyl Peptidase Inhibition Assay
pH
7.5±n/a
Temperature
310.15±n/a K
IC50
4.3±n/a nM
Citation
 Edmondson, SDMastracchio, AMathvink, RJHe, JHarper, BPark, YJBeconi, MDi Salvo, JEiermann, GJHe, HLeiting, BLeone, JFLevorse, DALyons, KPatel, RAPatel, SBPetrov, AScapin, GShang, JRoy, RSSmith, AWu, JKXu, SZhu, BThornberry, NAWeber, AE (2S,3S)-3-Amino-4-(3,3-difluoropyrrolidin-1-yl)-N,N-dimethyl-4-oxo-2-(4-[1,2,4]triazolo[1,5-a]-pyridin-6-ylphenyl)butanamide: a selective alpha-amino amide dipeptidyl peptidase IV inhibitor for the treatment of type 2 diabetes. J Med Chem 49:3614-27 (2006)  
Target
Name:
Dipeptidyl peptidase 4
Synonyms:
ADABP Adenosine deaminase complexing protein 2 CD_antigen=CD26 DPP4 DPPIV Dipeptidyl peptidase 4 (DPP IV) Dipeptidyl peptidase 4 (DPP4) Dipeptidyl peptidase 4 membrane form Dipeptidyl peptidase IV Dipeptidyl peptidase IV (DDP-IV) Dipeptidyl peptidase IV membrane form Dipeptidyl peptidase-IV (DPP-4) T-cell activation antigen CD26 | TP103
Type:
Enzyme
Mol. Mass.:
88271.01
Organism:
Homo sapiens (Human)
Description:
P27487
Residue:
766
  
Inhibitor
Name:
BDBM11144
Synonyms:
(1S,2S)-1-(dimethylcarbamoyl)-3-[(3S)-3-fluoropyrrolidin-1-yl]-3-oxo-1-(4-{[1,2,4]triazolo[1,5-a]pyridin-6-yl}phenyl)propan-2-aminium; 2,2,2-trifluoroacetate Biarylphenylalanine (S)-Fluoropyrrolidide Amide 23 | phenylalanine derived inhibitor, 5
Type:
Small organic molecule
Emp. Form.:
C22H26FN6O2
Mol. Mass.:
425.4787
SMILES:
CN(C)C(=O)[C@H]([C@H]([NH3+])C(=O)N1CC[C@H](F)C1)c1ccc(cc1)-c1ccc2ncnn2c1
:
Substrate
Name:
BDBM11057
Synonyms:
1-(2-aminoacetyl)-N-(4-methyl-2-oxo-2H-chromen-7-yl)pyrrolidine-2-carboxamide hydrobromide Gly-Pro-7-amidomethylcoumarin | Gly-Pro-AMC
Type:
Small organic molecule
Emp. Form.:
C17H19N3O4
Mol. Mass.:
329.3505
SMILES:
Cc1cc(=O)oc2cc(NC(=O)C3CCCN3C(=O)CN)ccc12
: