Target
Dipeptidyl peptidase 2
Ligand
BDBM11144
Substrate
BDBM11156
Meas. Tech.
Dipeptidyl Peptidase Inhibition Assay
IC50
>100000±n/a nM
Citation
 Edmondson, SDMastracchio, AMathvink, RJHe, JHarper, BPark, YJBeconi, MDi Salvo, JEiermann, GJHe, HLeiting, BLeone, JFLevorse, DALyons, KPatel, RAPatel, SBPetrov, AScapin, GShang, JRoy, RSSmith, AWu, JKXu, SZhu, BThornberry, NAWeber, AE (2S,3S)-3-Amino-4-(3,3-difluoropyrrolidin-1-yl)-N,N-dimethyl-4-oxo-2-(4-[1,2,4]triazolo[1,5-a]-pyridin-6-ylphenyl)butanamide: a selective alpha-amino amide dipeptidyl peptidase IV inhibitor for the treatment of type 2 diabetes. J Med Chem 49:3614-27 (2006)  
Target
Name:
Dipeptidyl peptidase 2
Synonyms:
DAP II DPP2_HUMAN Dipeptidyl aminopeptidase II Dipeptidyl peptidase 2 (DPP2) Dipeptidyl peptidase II (DPP II) Dipeptidyl peptidase II and dipeptidyl peptidase IV (DPP2 and DPP4) carboxytripeptidase dipeptidyl(amino)peptidase II | dipeptidylarylamidase
Type:
Protein
Mol. Mass.:
54339.29
Organism:
Homo sapiens (Human)
Description:
Q9UHL4
Residue:
492
  
Inhibitor
Name:
BDBM11144
Synonyms:
(1S,2S)-1-(dimethylcarbamoyl)-3-[(3S)-3-fluoropyrrolidin-1-yl]-3-oxo-1-(4-{[1,2,4]triazolo[1,5-a]pyridin-6-yl}phenyl)propan-2-aminium; 2,2,2-trifluoroacetate Biarylphenylalanine (S)-Fluoropyrrolidide Amide 23 | phenylalanine derived inhibitor, 5
Type:
Small organic molecule
Emp. Form.:
C22H26FN6O2
Mol. Mass.:
425.4787
SMILES:
CN(C)C(=O)[C@H]([C@H]([NH3+])C(=O)N1CC[C@H](F)C1)c1ccc(cc1)-c1ccc2ncnn2c1
:
Substrate
Name:
BDBM11156
Synonyms:
1-(2-aminohexanoyl)-N-(4-methyl-2-oxo-2H-chromen-7-yl)pyrrolidine-2-carboxamide Nle-Pro-AMC
Type:
Emp. Form.:
Mol. Mass.:
SMILES:
: