Target
N-acylethanolamine-hydrolyzing acid amidase
Ligand
BDBM319807
Substrate
Meas. Tech.
Determining Endocannabinoid Hydrolase Activity
IC50
65300±n/a nM
Citation
 Liu, ZQiu, YRen, JLi, YYang, LZhu, C Substituted heterocyclic derivative, preparation method and use thereof US Patent  US10174015 Publication Date 1/8/2019 
Target
Name:
N-acylethanolamine-hydrolyzing acid amidase
Synonyms:
ASAH-like protein Acid ceramidase-like protein N-acylsphingosine amidohydrolase-like NAAA PLT
Type:
Enzyme
Mol. Mass.:
40073.12
Organism:
Homo sapiens (Human)
Description:
Q02083
Residue:
359
  
Inhibitor
Name:
BDBM319807
Synonyms:
US10174015, Compound 20
Type:
Small organic molecule
Emp. Form.:
C18H17NO4
Mol. Mass.:
311.3319
SMILES:
O=C(Cc1cccc(OCc2ccccc2)c1)N1CCOC1=O
: