Target
Bromodomain-containing protein 9 [134-239]
Ligand
BDBM321389
Substrate
Meas. Tech.
IC50 measurements for inhibitors using BRD9 AlphaLisa Binding Assay
IC50
13.0±n/a nM
Citation
 Albrecht, BKBellon, SFBurdick, DJCote, ACrawford, TDakin, LAHsiao-Wei Tsui, VHewitt, MCLeBlanc, YMagnuson, SRNasveschuk, CGRomero, FATang, YTaylor, AMWang, S Therapeutic compounds and uses thereof US Patent  US10183009 Publication Date 1/22/2019 
Target
Name:
Bromodomain-containing protein 9 [134-239]
Synonyms:
BRD9 BRD9_HUMAN
Type:
Enzyme Catalytic Domain
Mol. Mass.:
12286.22
Organism:
Homo sapiens (Human)
Description:
Q9H8M2[134-239]
Residue:
106
  
Inhibitor
Name:
BDBM321389
Synonyms:
6-[(E)-but-2-enyl]-4-[3-chloro-4-(morpholine-4-carbonyl)phenyl]-1H-pyrrolo[2,3-c]pyridin-7-one | US10183009, Example 51
Type:
Small organic molecule
Emp. Form.:
C22H22ClN3O3
Mol. Mass.:
411.881
SMILES:
C\C=C\Cn1cc(-c2ccc(C(=O)N3CCOCC3)c(Cl)c2)c2cc[nH]c2c1=O
: