Target
Proto-oncogene tyrosine-protein kinase receptor Ret [V804L]
Ligand
BDBM84747
Substrate
Meas. Tech.
In Vitro Assays
IC50
902±n/a nM
Citation
 Kim, JLWilson, KJBrubaker, JD Inhibitors of RET US Patent  US10183928 Publication Date 1/22/2019 
Target
Name:
Proto-oncogene tyrosine-protein kinase receptor Ret [V804L]
Synonyms:
CDHF12 PTC RET kinase (V804L) RET51 | RET_HUMAN
Type:
Enzyme Catalytic Domain
Mol. Mass.:
124332.32
Organism:
Homo sapiens (Human)
Description:
P07949[V804L]
Residue:
1114
  
Inhibitor
Name:
BDBM84747
Synonyms:
(B) ZD6474 US10183928, Vandetanib US10227329, Compound Vandetanib US11279688, Compound Vandetanib | Vandetanib
Type:
Emp. Form.:
C22H24BrFN4O
Mol. Mass.:
459.355
SMILES:
CN1CCC(COc2cc3ncnc(Nc4ccc(Br)cc4F)c3cc2C)CC1
: