Target
Proto-oncogene tyrosine-protein kinase receptor Ret [V804L]
Ligand
BDBM16673
Substrate
Meas. Tech.
In Vitro Assays
IC50
95.2±n/a nM
Citation
 Kim, JLWilson, KJBrubaker, JD Inhibitors of RET US Patent  US10183928 Publication Date 1/22/2019 
Target
Name:
Proto-oncogene tyrosine-protein kinase receptor Ret [V804L]
Synonyms:
CDHF12 PTC RET kinase (V804L) RET51 | RET_HUMAN
Type:
Enzyme Catalytic Domain
Mol. Mass.:
124332.32
Organism:
Homo sapiens (Human)
Description:
P07949[V804L]
Residue:
1114
  
Inhibitor
Name:
BDBM16673
Synonyms:
4-[4-({[4-chloro-3-(trifluoromethyl)phenyl]carbamoyl}amino)phenoxy]-N-methylpyridine-2-carboxamide BAY 43-9006 BAY439006 Hit compound, 8 Sorafenib US10183928, Sorafenib US10227329, Compound Sorafenib US10774070, Compound Sorafenib US11279688, Compound Sorafenib US9029401, Sorafenib US9902709, Comparative example 1 cid_216239
Type:
Small organic molecule
Emp. Form.:
C21H16ClF3N4O3
Mol. Mass.:
464.825
SMILES:
CNC(=O)c1cc(Oc2ccc(NC(=O)Nc3ccc(Cl)c(c3)C(F)(F)F)cc2)ccn1
: