Target
Coagulation factor XI
Ligand
BDBM246192
Substrate
Meas. Tech.
Measurement of FXIa Inhibition
IC50
1.50±n/a nM
Citation
 Röhrig, SHillisch, AStrassburger, JHeitmeier, SSchmidt, MVSchlemmer, KTersteegen, ABuchmüller, AGerdes, CSchäfer, MKinzel, TTeller, HSchirok, HKlar, JNunez, EJ Substituted oxopyridine derivatives and use thereof cardiovascular disorders US Patent  US10183932 Publication Date 1/22/2019 
Target
Name:
Coagulation factor XI
Synonyms:
Coagulation factor XIa Coagulation factor XIa light chain FA11_HUMAN Factor XIa PTA | Plasma thromboplastin antecedent
Type:
Enzyme
Mol. Mass.:
70130.58
Organism:
Homo sapiens (Human)
Description:
P03951
Residue:
625
  
Inhibitor
Name:
BDBM246192
Synonyms:
US10183932, Example 100 US9434690, 97 US9434690, 99 | US9822102, Example 100
Type:
Small organic molecule
Emp. Form.:
C28H26ClN3O6
Mol. Mass.:
535.976
SMILES:
COc1cn(C(CC2CCCOC2)C(=O)Nc2ccc(cc2)C(O)=O)c(=O)cc1-c1cc(Cl)ccc1C#N
: