Target
Coagulation factor XI
Ligand
BDBM246220
Substrate
Meas. Tech.
Measurement of FXIa Inhibition
IC50
0.600±n/a nM
Citation
 Röhrig, SHillisch, AStrassburger, JHeitmeier, SSchmidt, MVSchlemmer, KTersteegen, ABuchmüller, AGerdes, CSchäfer, MKinzel, TTeller, HSchirok, HKlar, JNunez, EJ Substituted oxopyridine derivatives and use thereof cardiovascular disorders US Patent  US10183932 Publication Date 1/22/2019 
Target
Name:
Coagulation factor XI
Synonyms:
Coagulation factor XIa Coagulation factor XIa light chain FA11_HUMAN Factor XIa PTA | Plasma thromboplastin antecedent
Type:
Enzyme
Mol. Mass.:
70130.58
Organism:
Homo sapiens (Human)
Description:
P03951
Residue:
625
  
Inhibitor
Name:
BDBM246220
Synonyms:
US10183932, Example 144 US9434690, 141 US9434690, 143 US9822102, Example 144
Type:
Small organic molecule
Emp. Form.:
C27H26ClN3O6
Mol. Mass.:
523.965
SMILES:
CCC(CC(C(=O)Nc1ccc(cc1)C(O)=O)n1cc(OC)c(cc1=O)-c1cc(Cl)ccc1C#N)OC
: