Target
Fatty-acid amide hydrolase 1
Ligand
BDBM50153376
Substrate
Meas. Tech.
In Vitro Human FAAH Fluorescent Assay
IC50
1500±n/a nM
Citation
 De Vivo, MScarpelli, RCavalli, AMigliore, MPiomelli, DHabrant, DFavia, A Multitarget FAAH and COX inhibitors and therapeutical uses thereof US Patent  US9630914 Publication Date 4/25/2017 
Target
Name:
Fatty-acid amide hydrolase 1
Synonyms:
Anandamide amidohydrolase FAAH FAAH1_HUMAN Fatty-acid amide hydrolase (FAAH) Oleamide hydrolase 1
Type:
Protein
Mol. Mass.:
63071.19
Organism:
Homo sapiens (Human)
Description:
O00519
Residue:
579
  
Inhibitor
Name:
BDBM50153376
Synonyms:
CHEMBL3774439 | US9630914, Example 10
Type:
Small organic molecule
Emp. Form.:
C20H22FNO4
Mol. Mass.:
359.3914
SMILES:
CCCCNC(=O)Oc1cccc(c1)-c1ccc(cc1F)C(C)C(O)=O
: